{"text_format":"1","workbook":"xlsx","n_sheets":9,"sheets":["入力","申請書","区分表","検定級リスト","賞区分","得点リスト(A区分）","得点リスト（Ｂ区分）","得点リスト(Ｃ区分）","学校名"],"not_rendered":{"charts":0,"images":0,"macros":1,"external_links":0,"defined_names":295,"comments":1,"pivot_tables":0},"unopened":[],"bounds":{"document_bytes":16777216,"sheet_cells":100000,"rows_first":2000,"rows_last":500,"rows_between":2000,"halvings":0,"cell_chars":16384,"cell_head_chars":4096},"cells_cut":0,"cells_raw":0,"read":"whole","date_system":"1900"}

{"sheet":"入力","index":0,"n_rows":63,"n_cols":61,"rows_kept":63,"cut":false,"hidden":false,"merged":[[29,1,29,3],[28,1,28,3],[27,1,27,3],[26,1,26,3],[25,1,25,3],[30,1,30,3],[47,1,47,3],[46,1,46,3],[45,1,45,3],[44,1,44,3],[43,1,43,3],[42,1,42,3],[62,5,63,5],[62,6,63,7],[48,1,48,3],[51,1,51,7],[52,1,52,3],[53,1,53,3],[54,1,54,3],[55,1,55,3],[56,1,56,3],[57,1,57,3],[49,1,49,3],[22,1,22,3],[23,1,23,3],[21,1,21,3],[59,7,60,7],[59,6,60,6],[24,1,24,3],[31,1,31,3],[36,1,36,3],[41,1,41,3],[35,1,35,3],[34,1,34,3],[33,1,33,7],[37,1,37,3],[38,1,38,3],[39,1,39,3],[40,1,40,3],[0,0,2,0],[3,0,3,1],[20,1,20,3],[8,0,8,1],[15,1,15,7],[16,1,16,3],[4,0,4,1],[5,0,5,1],[6,0,7,0],[9,0,9,1],[10,0,10,1],[11,0,13,0],[17,1,17,3],[18,1,18,3],[1,4,13,7],[19,1,19,3]]}
["申請日","年"]
[null,"月",null,null,"【入力の仕方】\n①青色に塗られた部分のみ入力してください。\n\n②作成したら、「印刷」ボタンを押してください。\n　※同じ資格を入力していると印刷に進めません。\n\n③印刷したものは押印し、先生に提出してください。\n\n④「保存」のボタンを押して、ファイルを保存し、先生にファイルを提出してください。\n　※全部消したいときは、「削除」ボタンを押してください。"]
[null,"日"]
["学校名"]
["氏名"]
["カタカナ"]
["ローマ字","姓"]
[null,"名"]
["学科・コース名"]
["学年"]
["性別"]
["生年月日","年（西暦）",null,null,null,null,null,null,null,null,null,null,null,null,"↓個数","↓個数","↓個数","↓個数","↓個数"]
[null,"月",null,null,null,null,null,null,"誕生日",null,null,null,null,null,{"$f":"COUNTIF(O36:O50,\">0\")","v":0},{"$f":"COUNTIF(P36:P50,\">0\")","v":0},{"$f":"COUNTIF(Q36:Q50,\">0\")","v":0},{"$f":"COUNTIF(R36:R50,\">0\")","v":0},{"$f":"COUNTIF(S36:S50,\">0\")","v":0},null,null,null,null,null,null,null,null,null,null,null,null,null,null,"重複探し"]
[null,"日",null,null,null,null,null,null,{"$f":"DATE(C12,C13,C14)","v":{"$error":"#NUM!"}},null,"重複","コンテスト重複","食品技能検定の数","クレーン系の数","消防設備士（１５点まで）","消防士系","危険物","パソコン系","簿記",null,null,null,null,null,null,null,null,null,null,null,null,null,null,{"$f":"IFERROR(HLOOKUP(\"〇\",AH15:BY18,3,FALSE),\"×\")","v":"×"}]
[null,null,null,null,null,null,null,null,null,null,{"$f":"COUNTIF(M18:M50,\">1\")","v":0},null,{"$f":"COUNTIF(B18:D32,区分表!$B$17)","v":0},{"$f":"SUM(N36:N50)","v":0},0,0,0,0,0,null,null,null,null,null,null,null,null,null,null,null,null,null,null,{"$f":"IF(AH16>1,\"〇\",\"\")","v":""},{"$f":"IF(AI16>1,\"〇\",\"\")","v":""},"","","","","","","","","","","","","","","","","","","","","","","",""]
[null,"区分A",null,null,null,null,null,null,null,null,null,null,null,null,null,null,null,null,null,null,null,null,null,null,null,null,null,null,null,null,null,null,null,{"$f":"COUNTIF($B$18:$D$32,AH$17)","v":0},{"$f":"COUNTIF($B$18:$D$32,AI$17)","v":0},0,0,{"$f":"COUNTIF($B$18:$D$32,AL$17)","v":0},0,{"$f":"COUNTIF(AN$18:AN$34,AN17)","v":0},{"$f":"COUNTIF(AO$18:AO$34,AO17)","v":0},0,0,0,{"$f":"COUNTIF($B$18:$D$32,AS$17)","v":0},{"$f":"COUNTIF($B$36:$D$50,AT$17)","v":0},{"$f":"COUNTIF($B$36:$D$50,AU$17)","v":0},0,0,0,0,0,0,0,0,0,0,{"$f":"COUNTIF($B$54:$D$58,BF$17)","v":0},{"$f":"COUNTIF($B$54:$D$58,BG$17)","v":0},0,0]
[null,"資格・検定、競技会等の名称",null,null,"コード","取得年月日（西暦/月/日）","賞・級\n合格・認定","得点",null,null,null,null,null,null,null,null,null,null,null,null,null,null,null,null,null,null,null,null,null,null,null,null,null,"海技士　航海（筆記試験合格）","海技士　機関（筆記試験合格）","小型船舶操縦士（免許状取得）","総合無線通信士","陸上無線技術士","海上無線通信士","工事担任者Ａ","工事担任者Ｄ","高等学校海洋情報技術検定","高等学校栽培漁業技術検定","高等学校潜水技術検定","高等学校エンジン技術検定","簿記検定","簿記実務検定","日本語ワープロ検定","情報処理技能検定","ビジネス文書実務検定","PC検定（文書作成）","情報技術検定","情報処理検定","珠算・電卓実務検定試験","食物調理技術検定","陸上特殊無線技士","海上特殊無線技士","実用英語技能検定試験","技術英語能力検定（旧：工業英語能力検定）","実用数学 技能検定","日本漢字能力検定"]
[null,{"$f":"IF(E18=\"\",\"\",VLOOKUP(E18,区分表!$A$2:$I$104,2,FALSE))","v":""},null,null,null,null,null,{"$f":"IF($B18=\"\",\"\",IF($AC18=300,5,IF($AF18=200,15/2,VLOOKUP(J18,'得点リスト(A区分）'!$D$2:$E$391,2,FALSE))))","v":""},{"$f":"VLOOKUP(B18,検定級リスト!$C$17:$D$115,2,FALSE)","v":{"$error":"#N/A"}},{"$f":"B18&G18","v":""},{"$f":"J18&F18","v":""},null,{"$f":"IF(K18=\"\",\"\",COUNTIF($K$18:$K$50,K18))","v":""},null,null,null,null,null,null,null,null,null,null,{"$f":"IF(AND($M$15=4,B18=区分表!$B$14),\"○\",\"\")","v":""},{"$f":"IF(AND($M$15=4,B18=区分表!$B$17),\"○\",\"\")","v":""},null,null,{"$f":"IF(AND($M$15=3,$B18=区分表!$B$17),\"○\",\"\")","v":""},{"$f":"COUNTIF(AA18:AB18,\"○\")*300","v":0},null,{"$f":"IF(AND($M$15=2,$B18=区分表!$B$17),\"○\",\"\")","v":""},{"$f":"COUNTIF(AD18:AE18,\"○\")*200","v":0},null,null,null,null,null,null,null,{"$f":"LEFT($J18,6)","v":""},{"$f":"LEFT($J18,6)","v":""}]
[null,{"$f":"IF(E19=\"\",\"\",VLOOKUP(E19,区分表!$A$2:$I$104,2,FALSE))","v":""},null,null,null,null,null,{"$f":"IF($B19=\"\",\"\",IF($AC19=300,5,IF($AF19=200,15/2,VLOOKUP(J19,'得点リスト(A区分）'!$D$2:$E$391,2,FALSE))))","v":""},{"$f":"VLOOKUP(B19,検定級リスト!$C$17:$D$115,2,FALSE)","v":{"$error":"#N/A"}},"",{"$f":"J19&F19","v":""},null,{"$f":"IF(K19=\"\",\"\",COUNTIF($K$18:$K$50,K19))","v":""},null,null,null,null,null,null,null,null,null,null,{"$f":"IF(AND($M$15=4,B19=区分表!$B$14),\"○\",\"\")","v":""},{"$f":"IF(AND($M$15=4,B19=区分表!$B$17),\"○\",\"\")","v":""},null,null,{"$f":"IF(AND($M$15=3,$B19=区分表!$B$17),\"○\",\"\")","v":""},{"$f":"COUNTIF(AA19:AB19,\"○\")*300","v":0},null,{"$f":"IF(AND($M$15=2,$B19=区分表!$B$17),\"○\",\"\")","v":""},{"$f":"COUNTIF(AD19:AE19,\"○\")*200","v":0},null,null,null,null,null,null,null,{"$f":"LEFT($J19,6)","v":""},""]
[null,{"$f":"IF(E20=\"\",\"\",VLOOKUP(E20,区分表!$A$2:$I$104,2,FALSE))","v":""},null,null,null,null,null,{"$f":"IF($B20=\"\",\"\",IF($AC20=300,5,IF($AF20=200,15/2,VLOOKUP(J20,'得点リスト(A区分）'!$D$2:$E$391,2,FALSE))))","v":""},{"$f":"VLOOKUP(B20,検定級リスト!$C$17:$D$115,2,FALSE)","v":{"$error":"#N/A"}},"","",null,"",null,null,null,null,null,null,null,null,null,null,{"$f":"IF(AND($M$15=4,B20=区分表!$B$14),\"○\",\"\")","v":""},{"$f":"IF(AND($M$15=4,B20=区分表!$B$17),\"○\",\"\")","v":""},null,null,{"$f":"IF(AND($M$15=3,$B20=区分表!$B$17),\"○\",\"\")","v":""},0,null,{"$f":"IF(AND($M$15=2,$B20=区分表!$B$17),\"○\",\"\")","v":""},0,null,null,null,null,null,null,null,"",""]
{"$rows_left_out":44}
{"sheet":"申請書","index":1,"n_rows":66,"n_cols":14,"rows_kept":66,"cut":false,"hidden":false,"merged":[[29,3,29,5],[29,6,29,7],[29,8,29,9],[29,10,29,11],[28,3,28,5],[28,6,28,7],[28,8,28,9],[28,10,28,11],[32,3,32,5],[32,6,32,7],[32,8,32,9],[32,10,32,11],[31,3,31,5],[31,6,31,7],[31,8,31,9],[31,10,31,11],[30,3,30,5],[30,6,30,7],[30,8,30,9],[30,10,30,11],[45,3,45,5],[45,6,45,7],[45,8,45,9],[45,10,45,11],[37,0,37,11],[33,10,33,11],[34,6,34,7],[34,8,34,9],[34,10,34,11],[34,3,34,5],[39,6,39,7],[39,8,39,9],[39,10,39,11],[44,8,44,9],[33,3,33,5],[33,6,33,7],[33,8,33,9],[49,3,49,5],[49,6,49,7],[49,8,49,9],[49,10,49,11],[48,3,48,5],[48,6,48,7],[48,8,48,9],[48,10,48,11],[47,3,47,5],[47,6,47,7],[47,8,47,9],[47,10,47,11],[46,3,46,5],[46,6,46,7],[46,8,46,9],[46,10,46,11],[63,5,64,11],[12,7,12,8],[21,3,21,5],[21,6,21,7],[21,8,21,9],[20,10,20,11],[24,10,24,11],[22,10,22,11],[24,6,24,7],[41,10,41,11],[42,3,42,5],[42,6,42,7],[42,8,42,9],[42,10,42,11],[43,3,43,5],[43,6,43,7],[59,3,59,5],[59,6,59,7],[59,8,59,9],[60,3,60,5],[63,0,64,2],[39,3,39,5],[63,3,64,4],[25,6,25,7],[26,3,26,5],[26,6,26,7],[26,8,26,9],[38,10,38,11],[56,3,56,5],[56,6,56,7],[56,8,56,9],[26,10,26,11],[25,10,25,11],[27,10,27,11],[38,8,38,9],[61,6,61,9],[61,10,61,11],[40,3,40,5],[40,6,40,7],[40,8,40,9],[40,10,40,11],[41,3,41,5],[41,6,41,7],[41,8,41,9],[3,0,3,11],[7,5,7,11],[11,5,11,11],[9,5,9,11],[21,10,21,11],[19,10,19,11],[22,6,22,7],[23,3,23,5],[20,6,20,7],[19,6,19,7],[20,3,20,5],[19,3,19,5],[19,8,19,9],[22,3,22,5],[20,8,20,9],[22,8,22,9],[23,8,23,9],[8,5,8,7],[23,6,23,7],[10,8,10,11],[10,5,10,6],[23,10,23,11],[60,6,60,7],[60,8,60,9],[60,10,60,11],[56,10,56,11],[18,0,18,11],[15,1,15,11],[35,10,35,11],[35,6,35,9],[53,6,53,9],[53,10,53,11],[38,3,38,5],[38,6,38,7],[44,10,44,11],[27,8,27,9],[27,3,27,5],[27,6,27,7],[25,3,25,5],[24,3,24,5],[25,8,25,9],[24,8,24,9],[43,8,43,9],[43,10,43,11],[44,3,44,5],[44,6,44,7],[50,6,50,7],[50,8,50,9],[51,10,51,11],[50,3,50,5],[50,10,50,11],[59,10,59,11],[52,8,52,9],[52,10,52,11],[52,3,52,5],[52,6,52,7],[51,3,51,5],[51,6,51,7],[51,8,51,9],[55,0,55,11],[57,3,57,5],[57,6,57,7],[57,8,57,9],[57,10,57,11],[58,3,58,5],[58,6,58,7],[58,8,58,9],[58,10,58,11]]}
["（様式１）"]
[null,null,null,null,null,"申請年月日",{"$f":"IF(入力!C1=\"\",\"\",入力!C1)","v":""},"年",{"$f":"IF(入力!C2=\"\",\"\",入力!C2)","v":""},"月",{"$f":"IF(入力!C3=\"\",\"\",入力!C3)","v":""},"日"]
[]
["マリンマイスター顕彰制度申請書"]
[]
["全国水産高等学校長協会　理事長　殿"]
[]
[null,null,null,"学校名",null,{"$f":"IF(入力!C4=\"\",\"\",入力!C4)","v":""}]
[null,null,null,"生徒氏名",null,{"$f":"IF(入力!C5=\"\",\"\",入力!C5)","v":""},null,null,"㊞"]
[null,null,null,"ﾌﾘｶﾞﾅ（ｶﾀｶﾅ）",null,{"$f":"IF(入力!C6=\"\",\"\",入力!C6)","v":""}]
[null,null,null,"ローマ字","姓",{"$f":"IF(入力!C7=\"\",\"\",入力!C7)","v":""},null,"名",{"$f":"IF(入力!C8=\"\",\"\",入力!C8)","v":""}]
[null,null,null,"学科・コース",null,{"$f":"IF(入力!C9=\"\",\"\",入力!C9)","v":""}]
[null,null,null,"学年",null,{"$f":"IF(入力!C10=\"\",\"\",入力!C10)","v":""},"年","性別：",null,{"$f":"IF(入力!C11=\"\",\"\",入力!C11)","v":""}]
[null,null,null,"生年月日",null,"西暦",{"$f":"IF(入力!C12=\"\",\"\",入力!C12)","v":""},"年",{"$f":"IF(入力!C13=\"\",\"\",入力!C13)","v":""},"月",{"$f":"IF(入力!C14=\"\",\"\",入力!C14)","v":""},"日"]
[]
[null,"　標記の件について、下記競技会等の成績、職業資格等を得ましたので、マリンマイスター顕彰制度実施要領第5条の規定に基づき合格証書の写しを添えて申請します。"]
[]
["習得した職業資格等及び協議会・コンクールの内容"]
["区分A"]
["No.","コード","資格・検定、競技会等の名称","主催団体等",null,null,"取得年月日\n(西暦）",null,"賞・級\n合格・認定",null,"得点"]
{"$rows_left_out":47}
{"sheet":"区分表","index":2,"n_rows":104,"n_cols":15,"rows_kept":104,"cut":false,"hidden":false,"merged":[[61,3,63,3],[76,3,87,3],[64,3,70,3]]}
["区分Ａ",null,null,20,15,10,5]
[101,"海技士　航海（筆記試験合格）","国土交通省","二級","三級","四級","五級"]
[102,"海技士　機関（筆記試験合格）","国土交通省","二級","三級","四級","五級"]
[103,"海技士　 機関（筆記試験合格）","国土交通省","内燃二級","内燃三級","内燃四級","内燃五級"]
[104,"小型船舶操縦士（免許状取得）","国土交通省",null,null,"1級","2級"]
[201,"総合無線通信士","総務省","第１級","第2級","第3級"]
[202,"陸上無線技術士","総務省","第１級","第2級"]
[203,"海上無線通信士","総務省",null,"第1級","第2級","第3級"]
[204,"工事担任者","総務省",null,"ＡＩ１種","ＡＩ２種","ＡＩ３種"]
[205,"工事担任者","総務省",null,"ＤＤ１種","ＤＤ２種","ＤＤ３種"]
[206,"潜水士","厚生労働省",null,null,"○"]
[301,"水産海洋技術検定","全国水産高等学校長協会",null,null,null,"○"]
[302,"高等学校海洋情報技術検定","全国水産高等学校長協会",null,null,"第1級","第2級"]
[303,"高等学校通信技術検定","全国水産高等学校長協会",null,null,"〇"]
[304,"高等学校栽培漁業技術検定","全国水産高等学校長協会",null,"1級","２級"]
[305,"食品技能検定","全国水産高等学校長協会",null,null,"第1類"]
[306,"食品技能検定","全国水産高等学校長協会",null,null,"第2類"]
[307,"食品技能検定","全国水産高等学校長協会",null,null,"第3類"]
[308,"ＨＡＣＣＰ基本技能検定","全国水産高等学校長協会",null,null,null,"〇"]
[309,"高等学校潜水技術検定","全国水産高等学校長協会",null,"１級","２級"]
{"$rows_left_out":85}
{"sheet":"検定級リスト","index":3,"n_rows":194,"n_cols":166,"rows_kept":194,"cut":false,"hidden":true,"merged":[]}
[null,"海技士　航海（筆記試験合格）","海技士　機関（筆記試験合格）","海技士　  機関（筆記試験合格）","小型船舶操縦士（免許状取得）","総合無線通信士","陸上無線技術士","海上無線通信士","工事担任者","工事担任者","潜水士","水産海洋技術検定","高等学校海洋情報技術検定","ＨＡＣＣＰ基本技能検定","高等学校通信技術検定","高等学校栽培漁業技術検定","食品技能検定","食品技能検定","食品技能検定","高等学校潜水技術検定","高等学校漁業技術検定","高等学校エンジン技術検定","生徒研究発表大会(全国大会)","生徒研究発表大会(地区大会)","生徒研究発表大会(校内大会)","ｶｯﾀｰﾚｰｽ大会(全国大会)","ｶｯﾀｰﾚｰｽ大会(地区大会)","ﾌｨｯｼﾝｸﾞ技能ｺﾝﾃｽﾄ(部門別)","食品技能ｺﾝﾃｽﾄ","ﾀﾞｲﾋﾞﾝｸﾞ技能ｺﾝﾃｽﾄ(全国大会)","ﾀﾞｲﾋﾞﾝｸﾞ技能ｺﾝﾃｽﾄ(地区大会)","栽培漁業検定ポスター・標語・スケッチ・コンテスト","意見・体験発表大会（全国大会）","意見・体験発表大会（地区大会）","意見・体験発表大会（校内大会）","マリンロボットコンテスト",null,"資格","ボイラ技士","第３種冷凍機械責任者","甲種危険物取扱者","乙種危険物取扱者（１５点まで）","ボイラ取扱技能講習","普通第一種圧力容器取扱作業主任者技能講習","玉掛け技能講習","第二種酸素欠乏危険作業特別講習","乙種危険物取扱者（２０点まで）","丙種危険物取扱者","電気工事士２種","アーク溶接基本級A-2F\n※ＪＩＳ溶接評価試験","アーク溶接業務特別教育講習修了証","ガス溶接技能者講習修了証","販売士","簿記検定","簿記実務検定","ビジネス文書実務検定","PC検定（文書作成）","食物調理技術検定","陸上特殊無線技士","海上特殊無線技士","レーダー級海上特殊無線技士","情報技術検定","情報処理検定","移動式小型クレーン","実用英語技能検定試験","フォークリフト運転技能講習",null,"資格・大会","食の６次産業化プロデューサー","食品衛生責任者","実用数学 技能検定","日本漢字能力検定","うまいもん甲子園","全日本スポーツダイビング室内選手権大会\n５０ｍフリッパー競技（高校生の部：文部科学大臣賞対象競技のみ）","ボイラー整備士","消防設備士（１５点まで）","溶接技能者評価試験（１０点まで）※JIS溶接評価試験","日本語ワープロ検定","情報処理技能検定","珠算・電卓実務検定試験","クレーン運転特別教育","低圧電気取扱業務特別教育","技術英語能力検定（旧：工業英語能力検定）","ドローン検定","家庭動物飼育検定","生物分類技能検定","船の文化検定","日本さかな検定","簿記能力検定","アマチュア無線技士","海上特殊無線技士　","アマチュア無線技士　"]
[null,"a1","a2","a3","a4","a5","a6","a7","a8","a9","a10","a11","a12","a13","a14","a15","a16","a17","a18","a19","a20","a21","a22","a23","a24","a25","a26","a27","a28","a29","a30","a31","a32","a33","a34","a35","a36","a37","a38","a39","a40","a41","a42","a43","a44","a45","a46","a47","a48","a49","a50","a51","a52","a53","a54","a55","a56","a57","a58","a59","a60","a61","a62","a63","a64","a65","a66","a67","a68","a69","a70","a71","a72","a73","a74","a75","a76","a77","a78","a79","a80","a81","a82","a83","a84","a85","a86","a87","a88","a89","a90","a91","a92","a93","a94","a95","a96","a97","a98","a99","a100","a101","a102","a103","a104","a105","a106","a107","a108","a109","a110","a111","a112","a113","a114","a115","a116","a117","a118","a119","a120","a121","a122","a123","a124","a125","a126","a127","a128","a129","a130","a131","a132","a133","a134","a135","a136","a137","a138","a139","a140","a141","a142","a143","a144","a145","a146","a147","a148","a149","a150","a151","a152","a153","a154","a155","a156","a157","a158","a159","a160","a161","a162","a163","a164","a165"]
[null,"二級","二級","内燃二級","1級","第１級","第１級","第1級","ＡＩ１種",null,"合格","合格","第1級","合格","合格","1級","第1類",null,null,"１級","合格","１級","最優秀","最優秀",null,"優勝","優勝","優勝","総合優勝","総合優勝","総合優勝","最優秀","最優秀","最優秀",null,"総合優勝",null,15,"２級","合格","甲種","1類","合格","合格","合格","合格",null,"合格","合格","合格","合格","合格","３級","2級","1級","1級","1級","1級","第1級","第1級","合格","1級","1級","合格","準1級","合格",null,10,"レベル1","合格","準1級","準1級","全国優勝","優勝","合格","乙1種","A-2F","1級","1級","1級","合格","合格","準ﾌﾟﾛﾌｪｯｼｮﾅﾙ（旧：２級）","第1級","合格","3級","上級","１級","１級","第1級","第3級","第3級"]
[null,"三級","三級","内燃三級","2級","第2級","第2級","第2級","ＡＩ２種",null,null,null,"第2級",null,null,"２級","第2類",null,null,"２級",null,"２級","優秀","優秀",null,"2位",null,null,"2位","2位",null,"優秀","優秀","優秀",null,"2位",null,10,null,null,null,"2類",null,null,null,null,null,null,null,null,null,null,null,"3級","2級","2級","2級","2級","第2級","第2級",null,"2級","2級",null,"2級",null,null,5,null,null,"2級","2級","地区代表",null,null,"乙2種","G-1F","準1級","準1級","2級",null,null,"1級（旧：準２級）","第2級",null,"4級","中級","２級","２級","第2級",null,"第4級"]
[null,"四級","四級","内燃四級",null,"第3級",null,"第3級","ＡＩ３種",null,null,null,null,null,null,null,"第3類",null,null,null,null,null,null,null,null,"3位",null,null,"3位","3位",null,null,null,null,null,"3位",null,5,null,null,null,"3類",null,null,null,null,null,null,null,null,null,null,null,null,"3級","3級","3級","3級",null,null,null,null,null,null,"準2級",null,null,2,null,null,"準2級","準2級",null,null,null,"乙3種","SN-1F","2級","2級","3級",null,null,"2級（旧：３級）","第3級",null,null,"初級","３級","３級"]
[null,"五級","五級","内燃五級",null,null,null,"第4級","ＤＤ１種",null,null,null,null,null,null,null,null,null,null,null,null,null,null,null,null,null,null,null,null,null,null,null,null,null,null,null,null,2,null,null,null,"4類",null,null,null,null,null,null,null,null,null,null,null,null,null,null,null,null,null,null,null,null,null,null,"3級",null,null,1,null,null,"3級","3級",null,null,null,"乙4種",null,"準2級","準2級",null,null,null,"3級（旧：４級）","第4級"]
[null,null,null,null,null,null,null,null,"ＤＤ２種",null,null,null,null,null,null,null,null,null,null,null,null,null,null,null,null,null,null,null,null,null,null,null,null,null,null,null,null,null,null,null,null,"5類",null,null,null,null,null,null,null,null,null,null,null,null,null,null,null,null,null,null,null,null,null,null,null,null,null,null,null,null,null,null,null,null,null,"乙5種",null,"3級","3級"]
[null,null,null,null,null,null,null,null,"ＤＤ３種",null,null,null,null,null,null,null,null,null,null,null,null,null,null,null,null,null,null,null,null,null,null,null,null,null,null,null,null,null,null,null,null,"6類",null,null,null,null,null,null,null,null,null,null,null,null,null,null,null,null,null,null,null,null,null,null,null,null,null,null,null,null,null,null,null,null,null,"乙6種"]
[null,null,null,null,null,null,null,null,null,null,null,null,null,null,null,null,null,null,null,null,null,null,null,null,null,null,null,null,null,null,null,null,null,null,null,null,null,null,null,null,null,null,null,null,null,null,null,null,null,null,null,null,null,null,null,null,null,null,null,null,null,null,null,null,null,null,null,null,null,null,null,null,null,null,null,"乙7種"]
[]
[]
[]
[]
[]
[null,null,"検定級リスト",null,null,null,"クレーン系リスト"]
[]
[null,null,"海技士　航海（筆記試験合格）","a1_",null,null,"移動式小型クレーン"]
[null,null,"海技士　機関（筆記試験合格）","a2_",null,null,"フォークリフト運転技能講習"]
[null,null,"海技士　 機関（筆記試験合格）","a3_",null,null,"アーク溶接業務特別教育講習修了証"]
[null,null,"小型船舶操縦士（免許状取得）","a4_",null,null,"ガス溶接技能者講習修了証"]
{"$rows_left_out":175}
{"sheet":"賞区分","index":4,"n_rows":4,"n_cols":3,"rows_kept":4,"cut":false,"hidden":true,"merged":[]}
[]
[null,"マリンマイスターシルバー",46]
[null,"マリンマイスターゴールド",61]
[null,"マリンマイスタープラチナ",60]

{"sheet":"得点リスト(A区分）","index":5,"n_rows":122,"n_cols":7,"rows_kept":122,"cut":false,"hidden":true,"merged":[]}
[null,"得点用",null,null,null,null,"入力用"]
[null,"海技士　航海（筆記試験合格）","二級",{"$f":"B2&C2","v":"海技士　航海（筆記試験合格）二級"},20,null,"コード"]
[null,"海技士　航海（筆記試験合格）","三級",{"$f":"B3&C3","v":"海技士　航海（筆記試験合格）三級"},15,null,101]
[null,"海技士　航海（筆記試験合格）","四級","海技士　航海（筆記試験合格）四級",10,null,102]
[null,"海技士　航海（筆記試験合格）","五級","海技士　航海（筆記試験合格）五級",5,null,103]
[null,"海技士　機関（筆記試験合格）","二級","海技士　機関（筆記試験合格）二級",20,null,104]
[null,"海技士　機関（筆記試験合格）","三級","海技士　機関（筆記試験合格）三級",15,null,201]
[null,"海技士　機関（筆記試験合格）","四級","海技士　機関（筆記試験合格）四級",10,null,202]
[null,"海技士　機関（筆記試験合格）","五級","海技士　機関（筆記試験合格）五級",5,null,203]
[null,"海技士　 機関（筆記試験合格）","内燃二級","海技士　 機関（筆記試験合格）内燃二級",20,null,204]
[null,"海技士　 機関（筆記試験合格）","内燃三級","海技士　 機関（筆記試験合格）内燃三級",15,null,205]
[null,"海技士　 機関（筆記試験合格）","内燃四級","海技士　 機関（筆記試験合格）内燃四級",10,null,206]
[null,"海技士　 機関（筆記試験合格）","内燃五級","海技士　 機関（筆記試験合格）内燃五級",5,null,301]
[null,"小型船舶操縦士（免許状取得）","1級","小型船舶操縦士（免許状取得）1級",10,null,302]
[null,"小型船舶操縦士（免許状取得）","2級","小型船舶操縦士（免許状取得）2級",5,null,303]
[null,"総合無線通信士","第１級","総合無線通信士第１級",20,null,304]
[null,"総合無線通信士","第2級","総合無線通信士第2級",15,null,305]
[null,"総合無線通信士","第3級","総合無線通信士第3級",10,null,306]
[null,"陸上無線技術士","第１級","陸上無線技術士第１級",20,null,307]
[null,"陸上無線技術士","第2級","陸上無線技術士第2級",15,null,308]
{"$rows_left_out":103}
{"sheet":"得点リスト（Ｂ区分）","index":6,"n_rows":85,"n_cols":7,"rows_kept":85,"cut":false,"hidden":true,"merged":[]}
[null,"得点用"]
[null,"ボイラ技士","２級",{"$f":"B2&C2","v":"ボイラ技士２級"},10]
[null,"第３種冷凍機械責任者","合格","第３種冷凍機械責任者合格",15]
[null,"甲種危険物取扱者","甲種","甲種危険物取扱者甲種",15]
[null,"乙種危険物取扱者（１５点まで）","1類","乙種危険物取扱者（１５点まで）1類",5]
[null,"乙種危険物取扱者（１５点まで）","2類","乙種危険物取扱者（１５点まで）2類",5]
[null,"乙種危険物取扱者（１５点まで）","3類","乙種危険物取扱者（１５点まで）3類",5]
[null,"乙種危険物取扱者（１５点まで）","4類","乙種危険物取扱者（１５点まで）4類",5]
[null,"乙種危険物取扱者（１５点まで）","5類","乙種危険物取扱者（１５点まで）5類",5]
[null,"乙種危険物取扱者（１５点まで）","6類","乙種危険物取扱者（１５点まで）6類",5]
[null,"丙種危険物取扱者","合格","丙種危険物取扱者合格",2]
[null,"ボイラー整備士","合格","ボイラー整備士合格",10]
[null,"消防設備士（１５点まで）","乙1種","消防設備士（１５点まで）乙1種",5]
[null,"消防設備士（１５点まで）","乙2種","消防設備士（１５点まで）乙2種",5]
[null,"消防設備士（１５点まで）","乙3種","消防設備士（１５点まで）乙3種",5]
[null,"消防設備士（１５点まで）","乙4種","消防設備士（１５点まで）乙4種",5]
[null,"消防設備士（１５点まで）","乙5種","消防設備士（１５点まで）乙5種",5]
[null,"消防設備士（１５点まで）","乙6種","消防設備士（１５点まで）乙6種",5]
[null,"消防設備士（１５点まで）","乙7種","消防設備士（１５点まで）乙7種",5]
[null,"溶接技能者評価試験（１０点まで）※JIS溶接評価試験","A-2F","溶接技能者評価試験（１０点まで）※JIS溶接評価試験A-2F",5]
{"$rows_left_out":66}
{"sheet":"得点リスト(Ｃ区分）","index":7,"n_rows":53,"n_cols":12,"rows_kept":53,"cut":false,"hidden":true,"merged":[]}
[]
[null,"実用英語技能検定試験","準1級",{"$f":"B2&C2","v":"実用英語技能検定試験準1級"},10]
[null,"実用英語技能検定試験","2級","実用英語技能検定試験2級",5]
[null,"実用英語技能検定試験","準2級","実用英語技能検定試験準2級",2]
[null,"実用英語技能検定試験","3級","実用英語技能検定試験3級",1]
[null,"技術英語能力検定（旧：工業英語能力検定）","準ﾌﾟﾛﾌｪｯｼｮﾅﾙ（旧：２級）","技術英語能力検定（旧：工業英語能力検定）準ﾌﾟﾛﾌｪｯｼｮﾅﾙ（旧：２級）",10]
[null,"技術英語能力検定（旧：工業英語能力検定）","1級（旧：準２級）","技術英語能力検定（旧：工業英語能力検定）1級（旧：準２級）",5]
[null,"技術英語能力検定（旧：工業英語能力検定）","2級（旧：３級）","技術英語能力検定（旧：工業英語能力検定）2級（旧：３級）",2]
[null,"技術英語能力検定（旧：工業英語能力検定）","3級（旧：４級）","技術英語能力検定（旧：工業英語能力検定）3級（旧：４級）",1]
[null,"食の６次産業化プロデューサー","レベル1",{"$f":"B10&C10","v":"食の６次産業化プロデューサーレベル1"},1]
[null,"食品衛生責任者","合格",{"$f":"B11&C11","v":"食品衛生責任者合格"},1]
[null,"実用数学 技能検定","準1級","実用数学 技能検定準1級",10]
[null,"実用数学 技能検定","2級","実用数学 技能検定2級",5]
[null,"実用数学 技能検定","準2級","実用数学 技能検定準2級",2]
[null,"実用数学 技能検定","3級","実用数学 技能検定3級",1]
[null,"日本漢字能力検定","準1級","日本漢字能力検定準1級",10]
[null,"日本漢字能力検定","2級","日本漢字能力検定2級",5]
[null,"日本漢字能力検定","準2級","日本漢字能力検定準2級",2]
[null,"日本漢字能力検定","3級","日本漢字能力検定3級",1]
[null,"うまいもん甲子園","全国優勝","うまいもん甲子園全国優勝",10]
{"$rows_left_out":34}
{"sheet":"学校名","index":8,"n_rows":63,"n_cols":4,"rows_kept":63,"cut":false,"hidden":true,"merged":[]}
["年","月","日"]
[1989,1,1,"北海道小樽水産高等学校"]
[1990,2,2,"北海道函館水産高等学校"]
[1991,3,3,"北海道厚岸翔洋高等学校"]
[1992,4,4,"青森県立八戸水産高等学校"]
[1993,5,5,"岩手県立宮古水産高等学校"]
[1994,6,6,"岩手県立高田高等学校"]
[1995,7,7,"岩手県立久慈東高等学校"]
[1996,8,8,"宮城県水産高等学校"]
[1997,9,9,"宮城県気仙沼向洋高等学校"]
[1998,10,10,"秋田県立男鹿海洋高等学校"]
[1999,11,11,"山形県立加茂水産高等学校"]
[2000,12,12,"福島県立いわき海星高等学校"]
[2001,null,13,"茨城県立海洋高等学校"]
[2002,null,14,"栃木県立馬頭高等学校"]
[2003,null,15,"群馬県立万場高等学校"]
[2004,null,16,"千葉県立銚子商業高等学校"]
[2005,null,17,"千葉県立大原高等学校"]
[2006,null,18,"千葉県立館山総合高等学校"]
[2007,null,19,"東京都立大島海洋国際高等学校"]
{"$rows_left_out":43}