{"text_format":"1","workbook":"xlsx","n_sheets":8,"sheets":["入力","申請書","区分表","賞区分","得点リスト(A区分）","得点リスト(B区分）","検定級リスト","学校名"],"not_rendered":{"charts":0,"images":0,"macros":1,"external_links":0,"defined_names":156,"comments":1,"pivot_tables":0},"unopened":[],"bounds":{"document_bytes":16777216,"sheet_cells":100000,"rows_first":2000,"rows_last":500,"rows_between":2000,"halvings":0,"cell_chars":16384,"cell_head_chars":4096},"cells_cut":0,"cells_raw":0,"read":"whole","date_system":"1900"}

{"sheet":"入力","index":0,"n_rows":50,"n_cols":24,"rows_kept":50,"cut":false,"hidden":false,"merged":[[41,1,41,3],[42,1,42,3],[26,1,26,3],[27,1,27,3],[28,1,28,3],[29,1,29,3],[30,1,30,3],[40,1,40,3],[39,1,39,3],[38,1,38,7],[31,1,31,3],[32,1,32,3],[33,1,33,3],[34,1,34,3],[35,1,35,3],[36,1,36,3],[46,7,47,7],[46,6,47,6],[49,5,50,5],[49,6,50,7],[43,1,43,3],[44,1,44,3],[21,1,21,3],[25,1,25,3],[1,4,13,7],[19,1,19,3],[22,1,22,3],[23,1,23,3],[24,1,24,3],[0,0,2,0],[3,0,3,1],[20,1,20,3],[8,0,8,1],[15,1,15,7],[16,1,16,3],[4,0,4,1],[5,0,5,1],[6,0,7,0],[9,0,9,1],[10,0,10,1],[11,0,13,0],[17,1,17,3],[18,1,18,3]]}
["申請日","年"]
[null,"月",null,null,"【入力の仕方】\n①青色に塗られた部分のみ入力してください。\n\n②作成したら、「印刷」ボタンを押してください。\n　※同じ資格を入力していると印刷に進めません。\n\n③印刷したものは押印し、先生に提出してください。\n\n④「保存」のボタンを押して、ファイルを保存し、先生にファイルを提出してください。\n　※全部消したいときは、「削除」ボタンを押してください。"]
[null,"日"]
["学校名"]
["氏名"]
["カタカナ"]
["ローマ字","姓"]
[null,"名"]
["学科・コース名"]
["学年"]
["性別"]
["生年月日","年（西暦）"]
[null,"月",null,null,null,null,null,null,"誕生日"]
[null,"日",null,null,null,null,null,null,{"$f":"DATE(C12,C13,C14)","v":{"$error":"#NUM!"}},null,"重複","食品技能検定の数"]
[null,null,null,null,null,null,null,null,null,null,{"$f":"COUNTIF(L18:L45,\">1\")","v":0},{"$f":"COUNTIF(B18:D37,区分表!$B$17)","v":0}]
[null,"区分A"]
[null,"資格・検定、競技会等の名称",null,null,"コード","取得年月日（西暦/月/日）","賞・級\n合格・認定","得点"]
[null,{"$f":"IF(E18=\"\",\"\",VLOOKUP(E18,区分表!$A$2:$I$120,2,FALSE))","v":""},null,null,null,null,null,{"$f":"IF($B18=\"\",\"\",IF($U18=300,5,IF($X18=200,15/2,VLOOKUP(J18,'得点リスト(A区分）'!$D$2:$E$390,2,FALSE))))","v":""},{"$f":"VLOOKUP(B18,検定級リスト!$C$17:$D$100,2,FALSE)","v":{"$error":"#N/A"}},{"$f":"B18&G18","v":""},{"$f":"J18&F18","v":""},{"$f":"IF(K18=\"\",\"\",COUNTIF($K$18:$K$45,K18))","v":""},null,null,null,{"$f":"IF(AND($L$15=4,B18=区分表!$B$14),\"○\",\"\")","v":""},{"$f":"IF(AND($L$15=4,B18=区分表!$B$17),\"○\",\"\")","v":""},null,null,{"$f":"IF(AND($L$15=3,$B18=区分表!$B$17),\"○\",\"\")","v":""},{"$f":"COUNTIF(S18:T18,\"○\")*300","v":0},null,{"$f":"IF(AND($L$15=2,$B18=区分表!$B$17),\"○\",\"\")","v":""},{"$f":"COUNTIF(V18:W18,\"○\")*200","v":0}]
[null,{"$f":"IF(E19=\"\",\"\",VLOOKUP(E19,区分表!$A$2:$I$120,2,FALSE))","v":""},null,null,null,null,null,{"$f":"IF($B19=\"\",\"\",IF($U19=300,5,IF($X19=200,15/2,VLOOKUP(J19,'得点リスト(A区分）'!$D$2:$E$390,2,FALSE))))","v":""},{"$f":"VLOOKUP(B19,検定級リスト!$C$17:$D$100,2,FALSE)","v":{"$error":"#N/A"}},"",{"$f":"J19&F19","v":""},{"$f":"IF(K19=\"\",\"\",COUNTIF($K$18:$K$45,K19))","v":""},null,null,null,{"$f":"IF(AND($L$15=4,B19=区分表!$B$14),\"○\",\"\")","v":""},{"$f":"IF(AND($L$15=4,B19=区分表!$B$17),\"○\",\"\")","v":""},null,null,{"$f":"IF(AND($L$15=3,$B19=区分表!$B$17),\"○\",\"\")","v":""},{"$f":"COUNTIF(S19:T19,\"○\")*300","v":0},null,{"$f":"IF(AND($L$15=2,$B19=区分表!$B$17),\"○\",\"\")","v":""},{"$f":"COUNTIF(V19:W19,\"○\")*200","v":0}]
[null,{"$f":"IF(E20=\"\",\"\",VLOOKUP(E20,区分表!$A$2:$I$120,2,FALSE))","v":""},null,null,null,null,null,{"$f":"IF($B20=\"\",\"\",IF($U20=300,5,IF($X20=200,15/2,VLOOKUP(J20,'得点リスト(A区分）'!$D$2:$E$390,2,FALSE))))","v":""},{"$f":"VLOOKUP(B20,検定級リスト!$C$17:$D$100,2,FALSE)","v":{"$error":"#N/A"}},"","","",null,null,null,{"$f":"IF(AND($L$15=4,B20=区分表!$B$14),\"○\",\"\")","v":""},{"$f":"IF(AND($L$15=4,B20=区分表!$B$17),\"○\",\"\")","v":""},null,null,{"$f":"IF(AND($L$15=3,$B20=区分表!$B$17),\"○\",\"\")","v":""},0,null,{"$f":"IF(AND($L$15=2,$B20=区分表!$B$17),\"○\",\"\")","v":""},0]
{"$rows_left_out":31}
{"sheet":"申請書","index":1,"n_rows":53,"n_cols":15,"rows_kept":53,"cut":false,"hidden":false,"merged":[[8,6,8,8],[45,4,45,6],[45,7,45,8],[45,9,45,10],[42,9,42,10],[36,7,36,8],[33,4,33,6],[34,7,34,8],[34,4,34,6],[23,7,23,8],[26,9,26,10],[27,7,27,8],[27,9,27,10],[37,9,37,10],[44,4,44,6],[26,4,26,6],[26,7,26,8],[22,7,22,8],[24,4,24,6],[35,4,35,6],[28,9,28,10],[29,9,29,10],[10,9,10,12],[10,6,10,7],[50,6,51,12],[46,11,46,12],[46,4,46,6],[12,8,12,9],[38,11,38,12],[37,11,37,12],[15,1,15,12],[42,1,46,1],[20,4,20,6],[20,7,20,8],[20,9,20,10],[19,1,38,1],[37,4,37,6],[45,11,45,12],[50,0,51,3],[43,4,43,6],[50,4,51,5],[38,9,38,10],[24,7,24,8],[25,4,25,6],[25,7,25,8],[25,9,25,10],[48,0,48,8],[48,9,48,12],[25,11,25,12],[27,11,27,12],[19,11,19,12],[24,11,24,12],[23,11,23,12],[26,11,26,12],[34,11,34,12],[21,11,21,12],[22,11,22,12],[31,11,31,12],[32,11,32,12],[36,11,36,12],[28,11,28,12],[29,11,29,12],[30,11,30,12],[31,9,31,10],[32,9,32,10],[46,7,46,8],[42,7,42,8],[38,7,38,8],[43,7,43,8],[44,7,44,8],[33,11,33,12],[43,9,43,10],[44,9,44,10],[43,11,43,12],[44,11,44,12],[40,0,40,8],[40,9,40,12],[46,9,46,10],[42,11,42,12],[19,7,19,8],[18,7,18,8],[19,4,19,6],[18,4,18,6],[18,9,18,10],[42,4,42,6],[38,4,38,6],[21,4,21,6],[23,4,23,6],[37,7,37,8],[36,9,36,10],[19,9,19,10],[24,9,24,10],[23,9,23,10],[34,9,34,10],[21,9,21,10],[22,9,22,10],[36,4,36,6],[30,9,30,10],[3,0,3,12],[27,4,27,6],[35,7,35,8],[35,9,35,10],[35,11,35,12],[7,6,7,12],[11,6,11,12],[9,6,9,12],[33,7,33,8],[33,9,33,10],[20,11,20,12],[18,11,18,12],[28,4,28,6],[29,4,29,6],[30,4,30,6],[31,4,31,6],[32,4,32,6],[28,7,28,8],[29,7,29,8],[30,7,30,8],[31,7,31,8],[32,7,32,8],[21,7,21,8],[22,4,22,6]]}
["（様式１）"]
[null,null,null,null,null,null,"申請年月日",{"$f":"IF(入力!C1=\"\",\"\",入力!C1)","v":""},"年",{"$f":"IF(入力!C2=\"\",\"\",入力!C2)","v":""},"月",{"$f":"IF(入力!C3=\"\",\"\",入力!C3)","v":""},"日"]
[]
["マリンマイスター顕彰制度申請書"]
[]
["全国水産高等学校長協会　理事長　殿"]
[]
[null,null,null,null,"学校名",null,{"$f":"IF(入力!C4=\"\",\"\",入力!C4)","v":""}]
[null,null,null,null,"生徒氏名",null,{"$f":"IF(入力!C5=\"\",\"\",入力!C5)","v":""},null,null,"㊞"]
[null,null,null,null,"ﾌﾘｶﾞﾅ（ｶﾀｶﾅ）",null,{"$f":"IF(入力!C6=\"\",\"\",入力!C6)","v":""}]
[null,null,null,null,"ローマ字","姓",{"$f":"IF(入力!C7=\"\",\"\",入力!C7)","v":""},null,"名",{"$f":"IF(入力!C8=\"\",\"\",入力!C8)","v":""}]
[null,null,null,null,"学科・コース",null,{"$f":"IF(入力!C9=\"\",\"\",入力!C9)","v":""}]
[null,null,null,null,"学年",null,{"$f":"IF(入力!C10=\"\",\"\",入力!C10)","v":""},"年","性別：",null,{"$f":"IF(入力!C11=\"\",\"\",入力!C11)","v":""}]
[null,null,null,null,"生年月日",null,"西暦",{"$f":"IF(入力!C12=\"\",\"\",入力!C12)","v":""},"年",{"$f":"IF(入力!C13=\"\",\"\",入力!C13)","v":""},"月",{"$f":"IF(入力!C14=\"\",\"\",入力!C14)","v":""},"日"]
[]
[null,"　標記の件について、下記競技会等の成績、職業資格等を得ましたので、マリンマイスター顕彰制度実施要領第5条の規定に基づき合格証書の写しを添えて申請します。"]
[]
["習得した職業資格等及び協議会・コンクールの内容"]
["No.","区分","コード","資格・検定、競技会等の名称","主催団体等",null,null,"取得年月日\n(西暦）",null,"賞・級\n合格・認定",null,"得点"]
[1,"A",{"$f":"IF(入力!E18=\"\",\"\",入力!E18)","v":""},{"$f":"IF(C20=\"\",\"\",VLOOKUP(C20,区分表!$A$2:$I$101,2,FALSE))","v":""},{"$f":"IF(C20=\"\",\"\",VLOOKUP(D20,区分表!$B$2:$J$101,2,FALSE))","v":""},{"$f":"VLOOKUP(E20,区分表!C2:K60,2,FALSE)","v":{"$error":"#N/A"}},{"$f":"VLOOKUP(F20,M63:M121,2,FALSE)","v":{"$error":"#N/A"}},{"$f":"IF(入力!F18=\"\",\"\",入力!F18)","v":""},null,{"$f":"IF(入力!G18=\"\",\"\",入力!G18)","v":""},null,{"$f":"IF(入力!H18=\"\",\"\",入力!H18)","v":""},null,{"$f":"VLOOKUP(D20,検定級リスト!$C$17:$D$95,2,FALSE)","v":{"$error":"#N/A"}},{"$f":"D20&J20","v":""}]
{"$rows_left_out":34}
{"sheet":"区分表","index":2,"n_rows":78,"n_cols":8,"rows_kept":78,"cut":false,"hidden":true,"merged":[]}
["区分Ａ",null,null,20,15,10,5]
[101,"海技士　航海（筆記試験合格）","国土交通省","二級","三級","四級","五級"]
[102,"海技士　機関（筆記試験合格）","国土交通省","二級","三級","四級","五級"]
[103,"海技士　機関（筆記試験合格）","国土交通省","内燃二級","内燃三級","内燃四級","内燃五級"]
[104,"小型船舶操縦士（免許状取得）","国土交通省",null,null,"1級","2級"]
[201,"総合無線通信士","総務省","第１級","第2級","第3級"]
[202,"陸上無線技術士","総務省","第１級","第2級"]
[203,"海上無線通信士","総務省",null,"第1級","第2級","第3級"]
[204,"工事担任者","総務省",null,"ＡＩ１種","ＡＩ２種","ＡＩ３種"]
[205,"工事担任者","総務省",null,"ＤＤ１種","ＤＤ２種","ＤＤ３種"]
[206,"潜水士","厚生労働省",null,null,"○"]
[301,"水産海洋技術検定","全国水産高等学校長協会",null,null,null,"○"]
[302,"高等学校海洋情報技術検定","全国水産高等学校長協会",null,null,"第1級","第2級"]
[303,"高等学校通信技術検定","全国水産高等学校長協会",null,null,"〇"]
[304,"高等学校栽培漁業技術検定","全国水産高等学校長協会",null,"1級","２級"]
[305,"食品技能検定","全国水産高等学校長協会",null,null,"第1類"]
[306,"食品技能検定","全国水産高等学校長協会",null,null,"第2類"]
[307,"食品技能検定","全国水産高等学校長協会",null,null,"第3類"]
[308,"ＨＡＣＣＰ基本技能検定","全国水産高等学校長協会",null,null,null,"〇"]
[309,"高等学校潜水技術検定","全国水産高等学校長協会",null,"１級","２級"]
{"$rows_left_out":59}
{"sheet":"賞区分","index":3,"n_rows":4,"n_cols":3,"rows_kept":4,"cut":false,"hidden":true,"merged":[]}
[]
[null,"マリンマイスターシルバー",46]
[null,"マリンマイスターゴールド",61]
[null,"マリンマイスタープラチナ",60]

{"sheet":"得点リスト(A区分）","index":4,"n_rows":121,"n_cols":7,"rows_kept":121,"cut":false,"hidden":true,"merged":[]}
[null,"得点用",null,null,null,null,"入力用"]
[null,"海技士　航海（筆記試験合格）","二級",{"$f":"B2&C2","v":"海技士　航海（筆記試験合格）二級"},20,null,"コード"]
[null,"海技士　航海（筆記試験合格）","三級",{"$f":"B3&C3","v":"海技士　航海（筆記試験合格）三級"},15,null,101]
[null,"海技士　航海（筆記試験合格）","四級","海技士　航海（筆記試験合格）四級",10,null,102]
[null,"海技士　航海（筆記試験合格）","五級","海技士　航海（筆記試験合格）五級",5,null,103]
[null,"海技士　機関（筆記試験合格）","二級","海技士　機関（筆記試験合格）二級",20,null,104]
[null,"海技士　機関（筆記試験合格）","三級","海技士　機関（筆記試験合格）三級",15,null,201]
[null,"海技士　機関（筆記試験合格）","四級","海技士　機関（筆記試験合格）四級",10,null,202]
[null,"海技士　機関（筆記試験合格）","五級","海技士　機関（筆記試験合格）五級",5,null,203]
[null,"海技士　機関（筆記試験合格）","内燃二級","海技士　機関（筆記試験合格）内燃二級",20,null,204]
[null,"海技士　機関（筆記試験合格）","内燃三級","海技士　機関（筆記試験合格）内燃三級",15,null,205]
[null,"海技士　機関（筆記試験合格）","内燃四級","海技士　機関（筆記試験合格）内燃四級",10,null,206]
[null,"海技士　機関（筆記試験合格）","内燃五級","海技士　機関（筆記試験合格）内燃五級",5,null,301]
[null,"小型船舶操縦士（免許状取得）","1級","小型船舶操縦士（免許状取得）1級",10,null,302]
[null,"小型船舶操縦士（免許状取得）","2級","小型船舶操縦士（免許状取得）2級",5,null,303]
[null,"総合無線通信士","第１級","総合無線通信士第１級",20,null,304]
[null,"総合無線通信士","第2級","総合無線通信士第2級",15,null,305]
[null,"総合無線通信士","第3級","総合無線通信士第3級",10,null,306]
[null,"陸上無線技術士","第１級","陸上無線技術士第１級",20,null,307]
[null,"陸上無線技術士","第2級","陸上無線技術士第2級",15,null,308]
{"$rows_left_out":102}
{"sheet":"得点リスト(B区分）","index":5,"n_rows":45,"n_cols":12,"rows_kept":45,"cut":false,"hidden":true,"merged":[]}
[]
[null,"食の６次産業化プロデューサー","レベル1",{"$f":"B2&C2","v":"食の６次産業化プロデューサーレベル1"},1]
[null,"食品衛生責任者","合格",{"$f":"B3&C3","v":"食品衛生責任者合格"},1]
[null,"実用数学 技能検定","準1級","実用数学 技能検定準1級",10]
[null,"実用数学 技能検定","2級","実用数学 技能検定2級",5]
[null,"実用数学 技能検定","準2級","実用数学 技能検定準2級",2]
[null,"実用数学 技能検定","3級","実用数学 技能検定3級",1]
[null,"日本漢字能力検定","準1級","日本漢字能力検定準1級",10]
[null,"日本漢字能力検定","2級","日本漢字能力検定2級",5]
[null,"日本漢字能力検定","準2級","日本漢字能力検定準2級",2]
[null,"日本漢字能力検定","3級","日本漢字能力検定3級",1]
[null,"うまいもん甲子園","全国優勝","うまいもん甲子園全国優勝",10]
[null,"うまいもん甲子園","地区代表","うまいもん甲子園地区代表",2]
[null,"全日本スポーツダイビング室内選手権大会\n５０ｍフリッパー競技（高校生の部：文部科学大臣賞対象競技のみ）","優勝","全日本スポーツダイビング室内選手権大会\n５０ｍフリッパー競技（高校生の部：文部科学大臣賞対象競技のみ）優勝",10]
[]
[]
[]
[]
[]
[]
{"$rows_left_out":26}
{"sheet":"検定級リスト","index":6,"n_rows":89,"n_cols":74,"rows_kept":89,"cut":false,"hidden":true,"merged":[]}
[null,"海技士　航海（筆記試験合格）","海技士　機関（筆記試験合格）","海技士　機関（筆記試験合格）","小型船舶操縦士（免許状取得）","総合無線通信士","陸上無線技術士","海上無線通信士","工事担任者","工事担任者","潜水士","水産海洋技術検定","高等学校海洋情報技術検定","ＨＡＣＣＰ基本技能検定","高等学校通信技術検定","高等学校栽培漁業技術検定","食品技能検定","食品技能検定","食品技能検定","高等学校潜水技術検定","高等学校漁業技術検定","高等学校エンジン技術検定","生徒研究発表大会(全国大会)","生徒研究発表大会(地区大会)","生徒研究発表大会(校内大会)","ｶｯﾀｰﾚｰｽ大会(全国大会)","ｶｯﾀｰﾚｰｽ大会(地区大会)","ﾌｨｯｼﾝｸﾞ技能ｺﾝﾃｽﾄ(部門別)","食品技能ｺﾝﾃｽﾄ","ﾀﾞｲﾋﾞﾝｸﾞ技能ｺﾝﾃｽﾄ(全国大会)","ﾀﾞｲﾋﾞﾝｸﾞ技能ｺﾝﾃｽﾄ(地区大会)","栽培漁業検定ポスター・標語・スケッチ・コンテスト","意見・体験発表大会（全国大会）","意見・体験発表大会（地区大会）","意見・体験発表大会（校内大会）","マリンロボットコンテスト",null,"資格","ボイラ技士","第３種冷凍機械責任者","甲種危険物取扱者","乙種危険物取扱者（１５点まで）","ボイラ取扱技能講習","普通第一種圧力容器取扱作業主任者技能講習","玉掛け技能講習","第二種酸素欠乏危険作業特別講習","乙種危険物取扱者（２０点まで）","丙種危険物取扱者","電気工事士２種","アーク溶接基本級A-2F\n※ＪＩＳ溶接評価試験","アーク溶接業務特別教育講習修了証","ガス溶接技能者講習修了証","販売士","簿記検定","簿記実務検定","ビジネス文書実務検定","PC検定（文書作成）","食物調理技術検定","陸上特殊無線技士","海上特殊無線技士","レーダー級海上特殊無線技士","情報技術検定","情報処理検定","移動式小型クレーン","実用英語技能検定試験","フォークリフト運転技能講習",null,"資格・大会","食の６次産業化プロデューサー","食品衛生責任者","実用数学 技能検定","日本漢字能力検定","うまいもん甲子園","全日本スポーツダイビング室内選手権大会\n５０ｍフリッパー競技（高校生の部：文部科学大臣賞対象競技のみ）"]
[null,"a1","a2","a3","a4","a5","a6","a7","a8","a9","a10","a11","a12","a13","a14","a15","a16","a17","a18","a19","a20","a21","a22","a23","a24","a25","a26","a27","a28","a29","a30","a31","a32","a33","a34","a35","a36","a37","a38","a39","a40","a41","a42","a43","a44","a45","a46","a47","a48","a49","a50","a51","a52","a53","a54","a55","a56","a57","a58","a59","a60","a61","a62","a63","a64","a65","a66","a67","a68","a69","a70","a71","a72","a73"]
[null,"二級","二級","内燃二級","1級","第１級","第１級","第1級","ＡＩ１種",null,"合格","合格","第1級","合格","合格","1級","第1類",null,null,"１級","合格","１級","最優秀","最優秀",null,"優勝","優勝","優勝","総合優勝","総合優勝","総合優勝","最優秀","最優秀","最優秀",null,"総合優勝",null,15,"１級","合格","甲種","1類","合格","合格","合格","合格",null,"合格","合格","合格","合格","合格","３級","2級","1級","1級","1級","1級","第1級","第1級","合格","1級","1級","合格","準1級","合格",null,10,"レベル1","合格","準1級","準1級","全国優勝","優勝"]
[null,"三級","三級","内燃三級","2級","第2級","第2級","第2級","ＡＩ２種",null,null,null,"第2級",null,null,"２級","第2類",null,null,"２級",null,"２級","優秀","優秀",null,"2位",null,null,"2位","2位",null,"優秀","優秀","優秀",null,"2位",null,10,"２級",null,null,"2類",null,null,null,null,null,null,null,null,null,null,null,"3級","2級","2級","2級","2級","第2級","第2級",null,"2級","2級",null,"2級",null,null,5,null,null,"2級","2級","地区代表"]
[null,"四級","四級","内燃四級",null,"第3級",null,"第3級","ＡＩ３種",null,null,null,null,null,null,null,"第3類",null,null,null,null,null,null,null,null,"3位",null,null,"3位","3位",null,null,null,null,null,"3位",null,5,null,null,null,"3類",null,null,null,null,null,null,null,null,null,null,null,null,"3級","3級","3級","3級",null,null,null,null,null,null,"準2級",null,null,2,null,null,"準2級","準2級"]
[null,"五級","五級","内燃五級",null,null,null,null,"ＤＤ１種",null,null,null,null,null,null,null,null,null,null,null,null,null,null,null,null,null,null,null,null,null,null,null,null,null,null,null,null,2,null,null,null,"4類",null,null,null,null,null,null,null,null,null,null,null,null,null,null,null,null,null,null,null,null,null,null,"3級",null,null,1,null,null,"3級","3級"]
[null,null,null,null,null,null,null,null,"ＤＤ２種",null,null,null,null,null,null,null,null,null,null,null,null,null,null,null,null,null,null,null,null,null,null,null,null,null,null,null,null,null,null,null,null,"5類"]
[null,null,null,null,null,null,null,null,"ＤＤ３種",null,null,null,null,null,null,null,null,null,null,null,null,null,null,null,null,null,null,null,null,null,null,null,null,null,null,null,null,null,null,null,null,"6類"]
[]
[]
[]
[]
[]
[]
[]
[]
[null,null,"海技士　航海（筆記試験合格）","a1_"]
[null,null,"海技士　機関（筆記試験合格）","a2_"]
[null,null,"海技士　機関（筆記試験合格）","a3_"]
[null,null,"小型船舶操縦士（免許状取得）","a4_"]
{"$rows_left_out":70}
{"sheet":"学校名","index":7,"n_rows":63,"n_cols":4,"rows_kept":63,"cut":false,"hidden":true,"merged":[]}
["年","月","日"]
[1989,1,1,"北海道小樽水産高等学校"]
[1990,2,2,"北海道函館水産高等学校"]
[1991,3,3,"北海道厚岸翔洋高等学校"]
[1992,4,4,"青森県立八戸水産高等学校"]
[1993,5,5,"岩手県立宮古水産高等学校"]
[1994,6,6,"岩手県立高田高等学校"]
[1995,7,7,"岩手県立久慈東高等学校"]
[1996,8,8,"宮城県水産高等学校"]
[1997,9,9,"宮城県気仙沼向洋高等学校"]
[1998,10,10,"秋田県立男鹿海洋高等学校"]
[1999,11,11,"山形県立加茂水産高等学校"]
[2000,12,12,"福島県立いわき海星高等学校"]
[2001,null,13,"茨城県立海洋高等学校"]
[2002,null,14,"栃木県立馬頭高等学校"]
[2003,null,15,"群馬県立万場高等学校"]
[2004,null,16,"千葉県立銚子商業高等学校"]
[2005,null,17,"千葉県立大原高等学校"]
[2006,null,18,"千葉県立館山総合高等学校"]
[2007,null,19,"東京都立大島海洋国際高等学校"]
{"$rows_left_out":43}